1,10-Undecadien-6-ol

Normal alkane RI, non-polar column, temperature ramp

View large format table.

Column type Active phase I Reference Comment
CapillaryDB-51269.Shen X., Gao Y., et al., 200630. m/0.25 mm/0.25 μm, He, 40. C @ 2. min, 4. K/min, 250. C @ 10. min

References

Shen X., Gao Y., et al., 2006
Shen X.; Gao Y.; Su Q.D., Constituents of the essential oil of Rhizoma polygonati, Flavour Fragr. J., 2006, 21, 3, 556-558, https://doi.org/10.1002/ffj.1666 . [all data]