Epoxygeranial

Normal alkane RI, non-polar column, temperature ramp

View large format table.

Column type Active phase I Reference Comment
CapillaryDB-51238.Ouamba, Ouabonzi, et al., 200625. m/0.25 mm/0.15 μm, N2, 50. C @ 3. min, 4. K/min; Tend: 200. C

References

Ouamba, Ouabonzi, et al., 2006
Ouamba, J.-M.; Ouabonzi, A.; Ekouya, A.; Bessière, J.-M.; Menut, C.; Abena, A.A.; Banzouzi, J.-T., Volatile constituents of the essential oil leaf of Lantana salvifolia Jacq. (Verbenaceae), Flavour Fragr. J., 2006, 21, 1, 158-161, https://doi.org/10.1002/ffj.1553 . [all data]