Pyrazine, 2-(3-pentenyl)-3-methoxy, (Z)

Normal alkane RI, non-polar column, temperature ramp

View large format table.

Column type Active phase I Reference Comment
CapillaryOV-1011319.Mihara and Masuda, 19882. K/min; Column length: 50. m; Column diameter: 0.22 mm; Tstart: 80. C; Tend: 200. C

Normal alkane RI, polar column, temperature ramp

View large format table.

Column type Active phase I Reference Comment
CapillaryCarbowax 20M1729.Mihara and Masuda, 19882. K/min; Column length: 50. m; Column diameter: 0.22 mm; Tstart: 80. C; Tend: 200. C

References

Mihara and Masuda, 1988
Mihara, S.; Masuda, H., Structure-odor relationships for disubstituted pyrazines, J. Agric. Food Chem., 1988, 36, 6, 1242-1247, https://doi.org/10.1021/jf00084a029 . [all data]