Dauc-6(14),11-dien-5-ol

Normal alkane RI, non-polar column, temperature ramp

View large format table.

Column type Active phase I Reference Comment
CapillaryBP-11700.Lesueur, Ban, et al., 200650. m/0.22 mm/0.25 μm, He, 2. K/min, 220. C @ 20. min; Tstart: 60. C

Normal alkane RI, polar column, temperature ramp

View large format table.

Column type Active phase I Reference Comment
CapillaryBP-202453.Lesueur, Ban, et al., 200650. m/0.22 mm/0.25 μm, He, 2. K/min, 220. C @ 20. min; Tstart: 60. C

References

Lesueur, Ban, et al., 2006
Lesueur, D.; Ban, N.K.; Bighelli, A.; Muselli, A.; Casanova, J., Analysis of the root oil of Fokienia hodginsii (Dunn) Henry et Thomas (Cupressaceae) by GC, GC-MS and 13C-NMR, Flavour Fragr. J., 2006, 21, 1, 171-174, https://doi.org/10.1002/ffj.1557 . [all data]