Selina-4(15),6-diene

Normal alkane RI, non-polar column, temperature ramp

View large format table.

Column type Active phase I Reference Comment
CapillaryBP-11453.Boti, Yao, et al., 200650. m/0.22 mm/0.25 μm, 2. K/min, 220. C @ 20. min; Tstart: 60. C

Normal alkane RI, polar column, temperature ramp

View large format table.

Column type Active phase I Reference Comment
CapillaryBP-201618.Boti, Yao, et al., 200650. m/0.22 mm/0.25 μm, 2. K/min, 220. C @ 20. min; Tstart: 60. C

References

Boti, Yao, et al., 2006
Boti, J.B.; Yao, P.A.; Koukoua, G.; N'Guessan, T.Y.; Casanova, J., Components and chemical variability of Isolona campanulata Engler Diels leaf oil, Flavour Fragr. J., 2006, 21, 1, 166-170, https://doi.org/10.1002/ffj.1555 . [all data]