Cyclohexane, 1,2,3-triethyl

Kovats' RI, non-polar column, isothermal

View large format table.

Column type Active phase Temperature (C) I Reference Comment
CapillarySqualane100.1191.Mitra, Mohan, et al., 1974H2; Column length: 50. m; Column diameter: 0.2 mm
PackedMethyl Silicone130.1156.Antheaume and Guiochon, 1965
PackedMethyl Silicone130.1181.Antheaume and Guiochon, 1965

References

Mitra, Mohan, et al., 1974
Mitra, G.D.; Mohan, G.; Sinha, A., Gas chromatographic analysis of complex hydrocarbon mixtures, J. Chromatogr. A, 1974, 91, 633-648, https://doi.org/10.1016/S0021-9673(01)97944-0 . [all data]

Antheaume and Guiochon, 1965
Antheaume, J.; Guiochon, G., Application de la chromatographie en phase gazeuse à l'étude de la composition des fractions moyennes d'un brut pétrolier, Bull. Soc. Chim. Fr., 1965, 2, 298-307. [all data]