Oxidoselina-1,3,7(11)-trien-8-one

Normal alkane RI, non-polar column, custom temperature program

Data compiled by: NIST Mass Spectrometry Data Center, William E. Wallace, director

Column type Capillary
Active phase DB-1
Column length (m) 30.
Carrier gas Helium
Substrate
Column diameter (mm) 0.25
Phase thickness (μm)
Program 35 0C 4 0C/min -> 180 0C 10 0C/min -> 250 0C
I 1689.
Referencede Morais, Craveiro, et al., 1996
Comment MSDC-RI

References

de Morais, Craveiro, et al., 1996
de Morais, S.M.; Craveiro, A.A.; Machado, M.I.L.M.; Alencar, J.W.; Matos, J.A., Volatile constituents of Eugenia unifluora leaf oil from Notheastern Brazil, J. Ess. Oil Res., 1996, 8, 4, 449-451, https://doi.org/10.1080/10412905.1996.9700664 . [all data]