Benzene, 1,2-dimethyl-3,5-diethyl

Kovats' RI, non-polar column, isothermal

View large format table.

Column type Active phase Temperature (C) I Reference Comment
CapillaryOV-101100.1264.Matisová, Rukríglová, et al., 1988H2; Column length: 278. m; Column diameter: 0.25 mm

Kovats' RI, polar column, isothermal

View large format table.

Column type Active phase Temperature (C) I Reference Comment
CapillaryCarbowax 20M90.1518.9Döring, Estel, et al., 1974Column length: 100. m; Column diameter: 0.2 mm
CapillaryCarbowax 20M90.1497.2Döring, Estel, et al., 1974Column length: 100. m; Column diameter: 0.2 mm

Normal alkane RI, polar column, isothermal

View large format table.

Column type Active phase Temperature (C) I Reference Comment
CapillaryCarbowax 20M90.1519.Sutter, Peterson, et al., 1997

Normal alkane RI, polar column, custom temperature program

View large format table.

Column type Active phase I Reference Comment
CapillaryCarbowax 20M1519.Ivanciuc, Ivanciuc, et al., 2001Program: not specified

References

Matisová, Rukríglová, et al., 1988
Matisová, E.; Rukríglová, M.; Krupcík, J.; Kovacicová, E.; Holotík, S., Identification of alkylbenzenes up to C12 by capillary gas chromatography and combined gas chromatography-mass spectrometry. I. OV-101 as stationary phase, J. Chromatogr., 1988, 455, 301-309, https://doi.org/10.1016/S0021-9673(01)82129-4 . [all data]

Döring, Estel, et al., 1974
Döring, C.E.; Estel, D.; Fischer, R., Kapillar-gaschromatographische Charakterisierung von C10-bis C12-Aromaten, J. Prakt. Chem., 1974, 316, 1, 1-12, https://doi.org/10.1002/prac.19743160102 . [all data]

Sutter, Peterson, et al., 1997
Sutter, J.M.; Peterson, T.A.; Jurs, P.C., Prediction of gas chromatographic retention indices of alkylbenzenes, Anal. Chim. Acta., 1997, 342, 2-3, 113-122, https://doi.org/10.1016/S0003-2670(96)00578-8 . [all data]

Ivanciuc, Ivanciuc, et al., 2001
Ivanciuc, O.; Ivanciuc, T.; Klein, D.J.; Seitz, W.A.; Balaban, A.T., Quantitative structure-retention relationships for gas chromatographic retention indices of alkylbenzenes with molecular graph descriptors, SAR QSAR Environ. Res., 2001, 11, 5-6, 419-452, https://doi.org/10.1080/10629360108035362 . [all data]