Benzene, 1,2,4-trimethyl-5-propyl

Kovats' RI, polar column, isothermal

Data compiled by: NIST Mass Spectrometry Data Center, William E. Wallace, director

Column type Capillary
Active phase Carbowax 20M
Column length (m) 100.
Carrier gas
Substrate
Column diameter (mm) 0.2
Phase thickness (μm)
Temperature (C) 90.
I 1513.4
ReferenceDöring, Estel, et al., 1974
Comment MSDC-RI

Kovats' RI, non-polar column, isothermal

Data compiled by: NIST Mass Spectrometry Data Center, William E. Wallace, director

Column type CapillaryCapillary
Active phase OV-101OV-101
Column length (m) 50.278.
Carrier gas HeH2
Substrate
Column diameter (mm) 0.200.25
Phase thickness (μm)
Temperature (C) 100.100.
I 1252.1252.
ReferenceMatisová, Kovacicová, et al., 1989Matisová, Rukríglová, et al., 1988
Comment MSDC-RI MSDC-RI

References

Döring, Estel, et al., 1974
Döring, C.E.; Estel, D.; Fischer, R., Kapillar-gaschromatographische Charakterisierung von C10-bis C12-Aromaten, J. Prakt. Chem., 1974, 316, 1, 1-12, https://doi.org/10.1002/prac.19743160102 . [all data]