Benzene, 1-(1-methylethyl)-3-propyl

Normal alkane RI, non-polar column, custom temperature program

Data compiled by: NIST Mass Spectrometry Data Center, William E. Wallace, director

Column type CapillaryCapillary
Active phase SE-30OV-101
Column length (m)  52.
Carrier gas  H2
Substrate
Column diameter (mm)  0.25
Phase thickness (μm)  0.38
Program not specified70 - 160 C at 1.5 deg/min; 160 - 280 C at 15 deg/min 15 min at 280 C
I 1176.1170.
ReferenceXiuhua, Zhang, et al., 1996Matisová, Juranyiová, et al., 1991
Comment MSDC-RI MSDC-RI

References

Xiuhua, Zhang, et al., 1996
Xiuhua, Zh.; Zhang, L.; Che, X., Prediction of the Kovats retention indexes of polysubstituted alkylbenzenes, Chin. J. Chromatogr., 1996, 14, 4, 244-248. [all data]

Matisová, Juranyiová, et al., 1991
Matisová, E.; Juranyiová, E.; Kurán, P.; Brandsteterová, E.; Kocan, A.; Holotík, S., Analysis of multicomponent mixtures by high-resolution capillary gas chromatography and combined gas chromatography-mass spectrometry. I. Aromatics in a hydrocarbon matrix, J. Chromatogr., 1991, 552, 301-312, https://doi.org/10.1016/S0021-9673(01)95946-1 . [all data]