2,3-Dimethyl-1-heptene

Normal alkane RI, non-polar column, temperature ramp

Data compiled by: NIST Mass Spectrometry Data Center, William E. Wallace, director

Column type CapillaryCapillary
Active phase OV-1OV-101
Column length (m)  50.
Carrier gas  Helium
Substrate
Column diameter (mm)  0.20
Phase thickness (μm)  0.50
Tstart (C) 50.30.
Tend (C) 160.100.
Heat rate (K/min) 2.1.
Initial hold (min)  6.
Final hold (min)
I 842.842.
ReferenceOrav, Kailas, et al., 1999Orav, Kailas, et al., 1999, 2
Comment MSDC-RI MSDC-RI

References

Orav, Kailas, et al., 1999
Orav, A.; Kailas, T.; Muurisepp, M.; Kann, J., Composition of the oil from waste tires. 2. Fraction boiling at 160-180 0C, Proc. Estonian Acad. Sci. Chem., 1999, 48, 3, 136-140. [all data]

Orav, Kailas, et al., 1999, 2
Orav, A.; Kailas, T.; Muurisepp, M.; Kann, J., Composition of the oil from waste tires. 1. Fraction boiling at yp to 160 0C, Proc. Estonian Acad. Sci. Chem., 1999, 48, 1, 30-39. [all data]