(-)-3α,15α-Epoxy-4β-acetoxygymnomitrane

Van Den Dool and Kratz RI, non-polar column, custom temperature program

View large format table.

Column type Active phase I Reference Comment
CapillaryCP Sil 5 CB1887.Adio and Konig, 2007Program: not specified

Normal alkane RI, non-polar column, temperature ramp

View large format table.

Column type Active phase I Reference Comment
CapillaryCP Sil 5 CB1887.Adio, 2005H2, 3. K/min; Column length: 25. m; Tstart: 50. C; Tend: 230. C

References

Adio and Konig, 2007
Adio, A.M.; Konig, W.A., Sesquiterpenoids and norsesquiterpenoids from three liverworts, Tetrahedron: Asymmetry, 2007, 18, 14, 1693-1700, https://doi.org/10.1016/j.tetasy.2007.06.036 . [all data]

Adio, 2005
Adio, A.M., Isolation and structure elucidation of sesquiterpenoids from the essential oils of some liverworths (Hepaticae), Dissertation, Hamburg University, 2005, 265. [all data]