15-nor-3-Gymnomitrone

Normal alkane RI, non-polar column, temperature ramp

View large format table.

Column type Active phase I Reference Comment
CapillaryCP-Sil 5 CB1653.Hnawia, Menut, et al., 200930. m/0.25 mm/0.25 μm, Nitrogen, 5. K/min; Tstart: 50. C; Tend: 200. C
CapillaryCP Sil 5 CB1612.Adio, 2005H2, 3. K/min; Column length: 25. m; Tstart: 50. C; Tend: 230. C

References

Hnawia, Menut, et al., 2009
Hnawia, E.; Menut, C.; Agrebi, A.; Cabalion, P., Wood essential oil of two endemic trees from New Caledonia: Callitris sulcata (Parl.) Schltr. and Callitris neocaledonica Dummer, Biochem. Systematics Ecol., 2009, 36, 11, 859-866, https://doi.org/10.1016/j.bse.2008.08.007 . [all data]

Adio, 2005
Adio, A.M., Isolation and structure elucidation of sesquiterpenoids from the essential oils of some liverworths (Hepaticae), Dissertation, Hamburg University, 2005, 265. [all data]