Eudesma-4(15),7(11)-dien-8-one

Normal alkane RI, non-polar column, temperature ramp

View large format table.

Column type Active phase I Reference Comment
CapillaryCP Sil 5 CB1707.Tesso, König, et al., 2006H2, 3. K/min; Column length: 25. m; Column diameter: 0.25 mm; Tstart: 50. C; Tend: 230. C

References

Tesso, König, et al., 2006
Tesso, H.; König, W.A.; Son, P.T.; Giang, P.M., Composition of the essential oil of flowers of Chloranthus spicatus (Thunb.) Makino, Flavour Fragr. J., 2006, 21, 4, 592-597, https://doi.org/10.1002/ffj.1528 . [all data]