ethanamine, 2-chloro, N-methyl, N-ethyl

Van Den Dool and Kratz RI, non-polar column, temperature ramp

View large format table.

Column type Active phase I Reference Comment
CapillaryCP Sil 8 CB837.72Jagadeshwar Reddy, Prabhakar, et al., 200630. m/0.25 mm/0.25 μm, He, 50. C @ 5. min, 10. K/min, 300. C @ 2. min

References

Jagadeshwar Reddy, Prabhakar, et al., 2006
Jagadeshwar Reddy, T.; Prabhakar, S.; Ravi Kumar, M.; Vijaya Saradhi, U.V.R.; Vairamani, M., Mass spectral studies of a series of N,N-dialkyl aminoethyl-2-chlorides and trimethyl silyl ethers of N,N-dialkyl aminoethane-2-ols under electron impact conditions, J. Mass Spectrom., 2006, 41, 1, 59-70, https://doi.org/10.1002/jms.946 . [all data]