epi-β-Muurolol

Normal alkane RI, non-polar column, temperature ramp

View large format table.

Column type Active phase I Reference Comment
CapillaryDB-51647.Smelcerovic, Spiteller, et al., 200730. m/0.25 mm/0.25 μm, He, 10. K/min, 320. C @ 4. min; Tstart: 60. C

Normal alkane RI, non-polar column, custom temperature program

View large format table.

Column type Active phase I Reference Comment
CapillaryHP-5MS1684.Güllüce, Özer, et al., 200630. m/0.25 mm/0.25 μm, He; Program: 50C(3min) => 3C/min => 150C(10min) => 10C/min => 250C

References

Smelcerovic, Spiteller, et al., 2007
Smelcerovic, A.; Spiteller, M.; Ligon, A.P.; Smelcerovic, Z.; Raabe, N., Essential oil composition of Hypericum L. species from Southeastern Serbia and their chemotaxonomy, Biochem. Syst. Ecol., 2007, 35, 2, 99-113, https://doi.org/10.1016/j.bse.2006.09.012 . [all data]

Güllüce, Özer, et al., 2006
Güllüce, M.; Özer, H.; Baris, Ö.; Daferera, D.; Sahin, F.; Polissiou, M., Chemical Composition of the Essential Oil of Salvia aethiopis L., Turkish Journal of Biology, 2006, 30, 231-233. [all data]