L-Menthyl-D-lactate

Normal alkane RI, polar column, temperature ramp

Data compiled by: NIST Mass Spectrometry Data Center, William E. Wallace, director

Column type Capillary
Active phase DB-Wax
Column length (m) 30.
Carrier gas He
Substrate
Column diameter (mm) 0.25
Phase thickness (μm) 0.25
Tstart (C) 35.
Tend (C) 250.
Heat rate (K/min) 4.
Initial hold (min) 2.
Final hold (min) 10.
I 2004.
ReferenceGassenmeier, 2006
Comment MSDC-RI

References

Gassenmeier, 2006
Gassenmeier, K., Identification and quantification of L-menthyl lactate in essential oils from Mentha arvensis L. from India and model studies on the formation of L-menthyl lactate during essential oil production, Flavour Fragr. J., 2006, 21, 4, 725-730, https://doi.org/10.1002/ffj.1719 . [all data]