Cadina-1,4-dien-3-ol

Kovats' RI, non-polar column, temperature ramp

View large format table.

Column type Active phase I Reference Comment
CapillaryBP-11658.Ekundayo, Laakso, et al., 1988H2, 65. C @ 2. min, 5. K/min; Column length: 50. m; Column diameter: 0.33 mm; Tend: 220. C

Van Den Dool and Kratz RI, non-polar column, temperature ramp

View large format table.

Column type Active phase I Reference Comment
CapillaryMethyl Silicone1656.Sumathykutty, Rao, et al., 199950. m/0.25 mm/0.17 μm, N2, 2. K/min; Tstart: 80. C; Tend: 200. C

Normal alkane RI, non-polar column, temperature ramp

View large format table.

Column type Active phase I Reference Comment
CapillaryRSL-2001658.Jirovetz, Buchbauer, et al., 200230. m/0.32 mm/0.25 μm, H2, 40. C @ 5. min, 6. K/min, 280. C @ 5. min
CapillaryDB-11627.Velasco-Negueruela, Pérez Alonso, et al., 1991N2, 4. K/min; Column length: 30. m; Tstart: 80. C; Tend: 220. C

Normal alkane RI, non-polar column, custom temperature program

View large format table.

Column type Active phase I Reference Comment
CapillaryHP-51628.Liolios, Laouer, et al., 2007Program: not specified

References

Ekundayo, Laakso, et al., 1988
Ekundayo, O.; Laakso, I.; Adegbola, R.-M.; Oguntimein, B.; Sofowora, A.; Hiltunen, R., Essential oil constituents of Ashanti pepper (Piper guineense) fruits (berries), J. Agric. Food Chem., 1988, 36, 5, 880-882, https://doi.org/10.1021/jf00083a001 . [all data]

Sumathykutty, Rao, et al., 1999
Sumathykutty, M.A.; Rao, J.M.; Padmakumari, K.P.; Narayanan, C.S., Essential oil constituents of some Piper species, Flavour Fragr. J., 1999, 14, 5, 279-282, https://doi.org/10.1002/(SICI)1099-1026(199909/10)14:5<279::AID-FFJ821>3.0.CO;2-0 . [all data]

Jirovetz, Buchbauer, et al., 2002
Jirovetz, L.; Buchbauer, G.; Ngassoum, M.B.; Geissler, M., Aroma compound analysis of Piper nigrum and Piper guineense essential oils from Cameroon using solid-phase microextraction-gas chromatography, solid-phase microextraction-gas chromatography-mass spectrometry and olfactometry, J. Chromatogr. A, 2002, 976, 1-2, 265-275, https://doi.org/10.1016/S0021-9673(02)00376-X . [all data]

Velasco-Negueruela, Pérez Alonso, et al., 1991
Velasco-Negueruela, A.; Pérez Alonso, M.J.; Burzaco, A., Aceites esenciales de tomillos ibéricos. VI. Contribución al conocimiento del aceite esencial de thymus capitellatus Hoffmanns. Link, Anales Jard. Bot. Madrid, 1991, 49, 1, 77-81. [all data]

Liolios, Laouer, et al., 2007
Liolios, C.; Laouer, H.; Boulaacheb, N.; Gortzi, O.; Chinou, I., Chemical Composition and Antimicrobial Activity of the Essential Oil of Algherian Phlomis bovei De Noe subsp. bovei, Molecules, 2007, 12, 4, 772-781, https://doi.org/10.3390/12040772 . [all data]