( E)-nuciferyl butanoate

Van Den Dool and Kratz RI, non-polar column, temperature ramp

Data compiled by: NIST Mass Spectrometry Data Center, William E. Wallace, director

Column type CapillaryCapillary
Active phase SPB-1DB-5
Column length (m) 30.30.
Carrier gas HeHe
Substrate
Column diameter (mm) 0.250.2
Phase thickness (μm) 0.250.25
Tstart (C) 50.50.
Tend (C) 250.250.
Heat rate (K/min) 5.5.
Initial hold (min) 3.3.
Final hold (min) 15.15.
I 2004.2012.
ReferenceBlagojevic, Radulovic, et al., 2006Blagojevic, Radulovic, et al., 2006
Comment MSDC-RI MSDC-RI

References

Blagojevic, Radulovic, et al., 2006
Blagojevic, P.; Radulovic, N.; Palic, R.; Stojanovic, G., Chemical composition of the essential oils of Serbian wild-growing Srtemisia absinthium and Artemisia vulgaris, J. Agric. Food Chem., 2006, 54, 13, 4780-4789, https://doi.org/10.1021/jf060123o . [all data]