14-Oxo-calamene

Normal alkane RI, polar column, custom temperature program

Data compiled by: NIST Mass Spectrometry Data Center, William E. Wallace, director

Column type Capillary
Active phase Innowax FSC
Column length (m) 60.
Carrier gas He
Substrate
Column diameter (mm) 0.25
Phase thickness (μm) 0.25
Program 60C(10min) => 4C/min >220C (10min) => 1C/min => 240C
I 2470.
ReferenceBaser, Özek, et al., 2006
Comment MSDC-RI

References

Baser, Özek, et al., 2006
Baser, K.H.C.; Özek, G.; Özek, T.; Duran, A.; Duman, H., Composition of the essential oils of Rhabdosciadium oligocarpum (Post ex Boiss.) Hedge et Lamond and Rhabdosciadium microcalycinum Hand.-Mazz., Flavour Fragr. J., 2006, 21, 4, 650-655, https://doi.org/10.1002/ffj.1639 . [all data]