Mintoxide

Normal alkane RI, polar column, custom temperature program

View large format table.

Column type Active phase I Reference Comment
CapillaryInnowax FSC1926.Baser, Özek, et al., 200660. m/0.25 mm/0.25 μm, He; Program: 60C(10min) => 4C/min >220C (10min) => 1C/min => 240C

References

Baser, Özek, et al., 2006
Baser, K.H.C.; Özek, G.; Özek, T.; Duran, A.; Duman, H., Composition of the essential oils of Rhabdosciadium oligocarpum (Post ex Boiss.) Hedge et Lamond and Rhabdosciadium microcalycinum Hand.-Mazz., Flavour Fragr. J., 2006, 21, 4, 650-655, https://doi.org/10.1002/ffj.1639 . [all data]