Salviadienol

Normal alkane RI, non-polar column, temperature ramp

View large format table.

Column type Active phase I Reference Comment
CapillaryHP-51549.Ristic, Krivokuca-Dokic, et al., 200730. m/0.25 mm/0.25 μm, Helium, 4. K/min; Tstart: 40. C; Tend: 260. C

Normal alkane RI, non-polar column, custom temperature program

View large format table.

Column type Active phase I Reference Comment
CapillaryHP-51545.Ristic, Krivokuca-Dokic, et al., 200730. m/0.25 mm/0.25 μm, Helium; Program: not specified

Normal alkane RI, polar column, custom temperature program

View large format table.

Column type Active phase I Reference Comment
CapillaryInnowax FSC2110.Baser, Özek, et al., 200660. m/0.25 mm/0.25 μm, He; Program: 60C(10min) => 4C/min >220C (10min) => 1C/min => 240C
CapillaryInnowax FSC2110.Baser, Özek, et al., 200660. m/0.25 mm/0.25 μm, He; Program: 60C(10min) => 4C/min >220C (10min) => 1C/min => 240C

References

Ristic, Krivokuca-Dokic, et al., 2007
Ristic, M.; Krivokuca-Dokic, D.; Radanovic, D.; Nastovski, T., Etarsko ulje Arnica montata i Arnica chamissonis, Hem. Ind., 2007, 61, 5, 272-277, https://doi.org/10.2298/HEMIND0704272R . [all data]

Baser, Özek, et al., 2006
Baser, K.H.C.; Özek, G.; Özek, T.; Duran, A.; Duman, H., Composition of the essential oils of Rhabdosciadium oligocarpum (Post ex Boiss.) Hedge et Lamond and Rhabdosciadium microcalycinum Hand.-Mazz., Flavour Fragr. J., 2006, 21, 4, 650-655, https://doi.org/10.1002/ffj.1639 . [all data]