Hept-6-en-2-one, 5-methyl

Kovats' RI, non-polar column, temperature ramp

View large format table.

Column type Active phase I Reference Comment
CapillaryHP-5988.Oliveira, Leitao, et al., 200625. m/0.2 mm/0.33 μm, 3. K/min; Tstart: 60. C; Tend: 240. C

Van Den Dool and Kratz RI, non-polar column, temperature ramp

View large format table.

Column type Active phase I Reference Comment
CapillaryDB-5982.Bastos, Ishimoto, et al., 200630. m/0.25 mm/0.25 μm, 3. K/min; Tstart: 60. C; Tend: 220. C

References

Oliveira, Leitao, et al., 2006
Oliveira, D.R.; Leitao, G.G.; Santos, S.S.; Bizzo, H.R.; Lopes, D.; Alviano, C.S.; Alviano, D.S.; Leitao, S.G., Ethnopharmacological study of two Lippia species from Oriximina, Brazil, J. Ethnopharmacol., 2006, 108, 1, 103-108, https://doi.org/10.1016/j.jep.2006.04.018 . [all data]

Bastos, Ishimoto, et al., 2006
Bastos, D.H.M.; Ishimoto, E.; Marques, M.O.M.; Ferri, A.F.; Torres, E.A.F.S., Essential oil and antioxidant activity of green mate and mate tea (Ilex paraguariensis) infusions, J. Food Comp. Anal., 2006, 19, 6-7, 538-543, https://doi.org/10.1016/j.jfca.2005.03.002 . [all data]