Amorpha-4-ene-7-ol

Normal alkane RI, non-polar column, temperature ramp

View large format table.

Column type Active phase I Reference Comment
CapillaryCP Sil 5 CB1629.Ayoub, Al-Azizi, et al., 2006He, 10. K/min; Column length: 25. m; Tstart: 80. C; Tend: 270. C

References

Ayoub, Al-Azizi, et al., 2006
Ayoub, N.; Al-Azizi, M.; König, W.; Kubeczka, K.-H., Essential oils and a novel polyacetylene from Eryngium yuccifolium Michaux. (Apiaceae), Flavour Fragr. J., 2006, 21, 6, 864-868, https://doi.org/10.1002/ffj.1631 . [all data]