6,10-Epoxy-7(14)-isodaucane

Kovats' RI, polar column, temperature ramp

View large format table.

Column type Active phase I Reference Comment
CapillaryDB-Wax1941.Yukawa, Iwabuchi, et al., 2005He, 50. C @ 2. min, 3. K/min; Column length: 60. m; Column diameter: 0.25 mm; Tend: 220. C

References

Yukawa, Iwabuchi, et al., 2005
Yukawa, C.; Iwabuchi, H.; Komemushi, S.; Sawabe, A., Mono- and sesquiterpenoids of the volatile oil of Bursera graveolens, Flavour Fragr. J., 2005, 20, 6, 653-658, https://doi.org/10.1002/ffj.1523 . [all data]