(24S )-24-Methyl-26,26-dimethyl-27-norcholesta-5,22-dien-3β-ol

Van Den Dool and Kratz RI, non-polar column, temperature ramp

View large format table.

Column type Active phase I Reference Comment
CapillarySE-304605.Tundis, Passalacqua, et al., 200530. m/0.25 mm/0.25 μm, He, 60. C @ 3. min, 16. K/min, 280. C @ 10. min

References

Tundis, Passalacqua, et al., 2005
Tundis, R.; Passalacqua, N.G.; Peruzzi, L.; Statti, G.A.; Bonesi, M.; Loizzo, M.R.; Conforti, F.; Cesca, G.; Menichini, F., Comparative chemical variability of the non-polar extracts from Senecio cineraria group (Asteraceae), Biochem. Syst. Ecol., 2005, 33, 10, 1071-1076, https://doi.org/10.1016/j.bse.2005.02.009 . [all data]