Caryophylla-4(12),8(13) diene 5 β-ol

Kovats' RI, non-polar column, custom temperature program

Data compiled by: NIST Mass Spectrometry Data Center, William E. Wallace, director

Column type Capillary
Active phase DB-5MS
Column length (m) 30.
Carrier gas He
Substrate
Column diameter (mm) 0.25
Phase thickness (μm) 0.25
Program 60C(5min) => 2C/min => 140C= 5C/min => 250C(5min)
I 1656.
ReferenceTuberoso, Kowalczyk, et al., 2005
Comment MSDC-RI

Kovats' RI, non-polar column, temperature ramp

Data compiled by: NIST Mass Spectrometry Data Center, William E. Wallace, director

Column type Capillary
Active phase DB-1
Column length (m) 25.
Carrier gas He
Substrate
Column diameter (mm) 0.2
Phase thickness (μm)
Tstart (C) 60.
Tend (C) 220.
Heat rate (K/min) 3.
Initial hold (min) 3.
Final hold (min)
I 1625.
ReferenceMevy, Bessiere, et al., 2006
Comment MSDC-RI

References

Tuberoso, Kowalczyk, et al., 2005
Tuberoso, C.I.G.; Kowalczyk, A.; Coroneo, V.; Russo, M.T.; Dessì, S.; Cabras, P., Chemical Composition and Antioxidant, Antimicrobial, and Antifungal Activities of the Essential Oil of Achillea ligustica All., J. Agric. Food Chem., 2005, 53, 26, 10148-10153, https://doi.org/10.1021/jf0518913 . [all data]