Phenethylamine, 2,5-dimethoxy-4-propylthio, N-acetyl, sulfone, acetoxy-M

Kovats' RI, non-polar column, temperature ramp

View large format table.

Column type Active phase I Reference Comment
CapillaryHP-12760.Theobald, Fehn, et al., 200512. m/0.20 mm/0.33 μm, He, 100. C @ 3. min, 30. K/min, 300. C @ 8. min

References

Theobald, Fehn, et al., 2005
Theobald, D.S.; Fehn, S.; Maurer, H.H., New designer drug, 2,5-dimethoxy-4-propylthio-β-phenethylamine (2C-T-7): studies on its metabolism and toxicological detection in rat urine using gas chromatography/mass spectrometry, J. Mass Spectrom., 2005, 40, 1, 105-116, https://doi.org/10.1002/jms.784 . [all data]