4-Methoxy-2-(3-methyloxiranyl)-phenyl tiglate

Normal alkane RI, polar column, custom temperature program

Data compiled by: NIST Mass Spectrometry Data Center, William E. Wallace, director

Column type CapillaryCapillaryCapillary
Active phase HP-Innowax FSCHP-Innowax FSCHP-Innowax FSC
Column length (m) 60.60.60.
Carrier gas He He
Substrate
Column diameter (mm) 0.250.250.25
Phase thickness (μm) 0.250.250.25
Program 60C(10min) => 4C/min => 220C(10min) => 1C/min => 240C60C(10min) => 4C/min => 220C (10min) => 1C/min => 240C60C(10min) => 4C/min => 220C(10min) => 1C/min => 240C
I 2926.2926.2926.
ReferenceTabanca N., Demirci B., et al., 2007Tabanca, Demirci, et al., 2006Tabanca, Demirci, et al., 2005
Comment MSDC-RI MSDC-RI MSDC-RI

References

Tabanca N., Demirci B., et al., 2007
Tabanca N.; Demirci B.; Baser K.H.C.; Mincsovics E.; Khan S.I.; Jacob M.R.; Wedge D.E., Characterization of volatile constituents of Scaligeria tripartita and studies on the antifungal activity against phytopathogenic fungi, J. Chromatogr. B, 2007, 850, 1-2, 221-229, https://doi.org/10.1016/j.jchromb.2006.11.041 . [all data]

Tabanca, Demirci, et al., 2006
Tabanca, N.; Demirci, B.; Ozek, T.; Kirimer, N.; Can Baser, K.H.; Bedir, E.; Khan, I.A.; Wedge, D.E., Gas chromatographic-mass spectrometric analysis of essential oils from Pimpinella species gathered from Central and Northern Turkey, J. Chromatogr. A, 2006, 1117, 2, 194-205, https://doi.org/10.1016/j.chroma.2006.03.075 . [all data]

Tabanca, Demirci, et al., 2005
Tabanca, N.; Demirci, B.; Kirimer, N.; Baser, K.H.C.; Bedir, E.; Khand, I.A.; Wedge, D.E., Gas chromatographic-mass spectrometric analysis of essential oils from Pimpinella aurea, Pimpinella corymbosa, Pimpinella peregrina and Pimpinella puberula gathered from Eastern and Southern Turkey, J. Chromatogr. A, 2005, 1097, 1-2, 192-198, https://doi.org/10.1016/j.chroma.2005.10.047 . [all data]