z-Dihydroapofarnesene

Normal alkane RI, non-polar column, temperature ramp

View large format table.

Column type Active phase I Reference Comment
CapillaryRTX-11493.Sonboli A., Fakhari A.R., et al., 200560. m/0.25 mm/0.25 μm, He, 5. K/min, 250. C @ 10. min; Tstart: 60. C

References

Sonboli A., Fakhari A.R., et al., 2005
Sonboli A.; Fakhari A.R.; Sefidkon F., Chemical composition of the essential oil of Salvia macilenta from Iran, Chem. Nat. Compd. (Engl. Transl.), 2005, 41, 2, 168-170, https://doi.org/10.1007/s10600-005-0104-0 . [all data]