(E,E,Z)-2,4,6-Nonatrienal

Van Den Dool and Kratz RI, non-polar column, custom temperature program

View large format table.

Column type Active phase I Reference Comment
CapillarySE-541269.Schuh and Schieberle, 200630. m/0.32 mm/0.25 μm; Program: 40C(2min) => 6C/min => 150C => 20C/min => 230C
CapillaryDB-51276.Schuh and Schieberle, 200530. m/0.32 mm/0.25 μm; Program: 40C(2min) => 6C/min => 150C => 20C/min => 230C

Van Den Dool and Kratz RI, polar column, custom temperature program

View large format table.

Column type Active phase I Reference Comment
CapillaryFFAP1877.Schuh and Schieberle, 200630. m/0.32 mm/0.25 μm; Program: 40C(2min) => 6C/min => 150C => 20C/min => 230C

References

Schuh and Schieberle, 2006
Schuh, C.; Schieberle, P., Characterization of the Key Aroma Compounds in the Beverage Prepared from Darjeeling Black Tea: Quantitative Differences between Tea Leaves and Infusion, J. Agric. Food Chem., 2006, 54, 3, 916-924, https://doi.org/10.1021/jf052495n . [all data]

Schuh and Schieberle, 2005
Schuh, C.; Schieberle, P., Characterization of ( E, E, Z)-2,4,6-Nonatrienal as a character impact aroma compound of oat flakes, J. Agric. Food Chem., 2005, 53, 22, 8699-8705, https://doi.org/10.1021/jf051601i . [all data]