Muurol-5-en-4-one (cis-14)

Normal alkane RI, non-polar column, temperature ramp

View large format table.

Column type Active phase I Reference Comment
CapillaryDB-51688.Salehi, Sefidkon, et al., 200530. m/0.25 mm/0.25 μm, He, 60. C @ 4. min, 3. K/min; Tend: 220. C

References

Salehi, Sefidkon, et al., 2005
Salehi, P.; Sefidkon, F.; Bazzaz Tolami, L.; Sonboli, A., Essential oil composition of Salvia palaestina Benth. from Iran, Flavour Fragr. J., 2005, 20, 5, 525-527, https://doi.org/10.1002/ffj.1448 . [all data]