Cyclododecanone 2,2-dimethylpropanediol-1,3 acetal

Kovats' RI, non-polar column, isothermal

View large format table.

Column type Active phase Temperature (C) I Reference Comment
CapillaryOV-1150.1896.Rudenko and Rudenko, 2005He; Column diameter: 0.25 mm
CapillaryOV-1170.1908.4Rudenko and Rudenko, 2005He; Column diameter: 0.25 mm
CapillaryOV-1190.1930.3Rudenko and Rudenko, 2005He; Column diameter: 0.25 mm

Kovats' RI, polar column, isothermal

View large format table.

Column type Active phase Temperature (C) I Reference Comment
CapillaryCarbowax 40M150.2237.9Rudenko and Rudenko, 2005He; Column diameter: 0.25 mm
CapillaryCarbowax 40M170.2276.8Rudenko and Rudenko, 2005He; Column diameter: 0.25 mm
CapillaryCarbowax 40M190.2307.9Rudenko and Rudenko, 2005He; Column diameter: 0.25 mm

References

Rudenko and Rudenko, 2005
Rudenko, B.A.; Rudenko, G.I., Gas chromatography with open tubular columns of cyclododecane derivatives, J. Anal. Chem. USSR (Engl. Transl.), 2005, 60, 4, 345-348. [all data]