anti-4-cholesten-3-one, methyloxime derivative

Van Den Dool and Kratz RI, non-polar column, temperature ramp

View large format table.

Column type Active phase I Reference Comment
CapillaryDB-13163.Puglielli, Friedlich, et al., 200530. m/0.32 mm/0.25 μm, 185. C @ 2. min, 2. K/min, 295. C @ 30. min

References

Puglielli, Friedlich, et al., 2005
Puglielli, L.; Friedlich, A.L.; Setchell, K.D.R.; Nagano, S.; Opazo, C.; Cherny, R.A.; Barnham, K.J.; Wade, J.D.; Melov, S.; Kovacs, D.M.; Bush, A.I., Alzheimer disease β-amyloid activity mimics cholesterol oxidase, Journal of Clinical Investigation, 2005, 115, 9, 2556-2563, https://doi.org/10.1172/JCI23610 . [all data]