Isogermacrene

Normal alkane RI, non-polar column, temperature ramp

View large format table.

Column type Active phase I Reference Comment
CapillaryCP Sil 5 CB1446.Olawore, Ogunwande, et al., 200525. m/0.25 mm/0.15 μm, 3. K/min; Tstart: 50. C; Tend: 230. C

References

Olawore, Ogunwande, et al., 2005
Olawore, N.O.; Ogunwande, I.A.; Ekundayo, O.; Adeleke, K.A., Chemical composition of the leaf and fruit essential oils of Murraya paniculata (L.) Jack. (Syn. Murraya exotica Linn.), Flavour Fragr. J., 2005, 20, 1, 54-56, https://doi.org/10.1002/ffj.1365 . [all data]