Crassifolone

Van Den Dool and Kratz RI, non-polar column, temperature ramp

View large format table.

Column type Active phase I Reference Comment
CapillaryDB-11651.Menut, Cabalion, et al., 200530. m/0.25 mm/0.25 μm, N2, 5. K/min; Tstart: 50. C; Tend: 200. C

References

Menut, Cabalion, et al., 2005
Menut, C.; Cabalion, P.; Hnawia, E.; Agnaniet, H.; Waikedre, J.; Fruchier, A., Two new furanosesquiterpenes from Myoporum crassifolium from New Caledonia, Flavour Fragr. J., 2005, 20, 6, 621-625, https://doi.org/10.1002/ffj.1509 . [all data]