2-Ethyl-3,5-dimethyl-2-cyclopenten-1-one

Normal alkane RI, non-polar column, temperature ramp

View large format table.

Column type Active phase I Reference Comment
CapillaryDB-11120.Lee, Lee, et al., 200560. m/0.32 mm/0.25 μm, He, 35. C @ 4. min, 2. K/min, 230. C @ 25. min

Normal alkane RI, polar column, custom temperature program

View large format table.

Column type Active phase I Reference Comment
CapillaryDB-Wax1506.Lee, Lee, et al., 200560. m/0.32 mm/0.25 μm, He; Program: 30C(4min) => 2C/min => 170C(25min) => 10C/min => 210C(10min)

References

Lee, Lee, et al., 2005
Lee, K.-G.; Lee, S.-E.; Takeoka, G.R.; Kim, J.-H.; Park, B.-S., Antioxidant activity and characterization of volatile constituents of beechwood creosote, J. Sci. Food Agric., 2005, 85, 9, 1580-1586, https://doi.org/10.1002/jsfa.2156 . [all data]