2-hydroxy-1,8-cineole II

Normal alkane RI, non-polar column, temperature ramp

Data compiled by: NIST Mass Spectrometry Data Center, William E. Wallace, director

Column type Capillary
Active phase SPB-5
Column length (m) 30.
Carrier gas He
Substrate
Column diameter (mm) 0.53
Phase thickness (μm)
Tstart (C) 100.
Tend (C) 250.
Heat rate (K/min) 5.
Initial hold (min)
Final hold (min)
I 1247.
ReferenceKilic, Kollmannsberger, et al., 2005
Comment MSDC-RI

References

Kilic, Kollmannsberger, et al., 2005
Kilic, A.; Kollmannsberger, H.; Nitz, S., Glycosidically bound volatiles and flavor precursors in Laurus nobilis L., J. Agric. Food Chem., 2005, 53, 6, 2231-2235, https://doi.org/10.1021/jf040373+ . [all data]