5,5-Diethyltricosane

Kovats' RI, non-polar column, custom temperature program

Data compiled by: NIST Mass Spectrometry Data Center, William E. Wallace, director

Column type Capillary
Active phase HP-5MS
Column length (m) 30.
Carrier gas He
Substrate
Column diameter (mm) 0.25
Phase thickness (μm) 0.25
Program 60C(1.5min) => 20C/min => 130C => 4C/min => 315C (90min)
I 2613.
ReferenceKenig, Simons, et al., 2005
Comment MSDC-RI

References

Kenig, Simons, et al., 2005
Kenig, F.; Simons, D.-J.H.; Crich, D.; Cowen, J.P.; Ventura, G.T.; Rehbein-Khalily, T., Structure and distribution of branched aliphatic alkanes with quaternary carbon atoms in Cenomanian and Turonian black shales of Pasquia Hills (Saskatchewan, Canada), Org. Geochem., 2005, 36, 1, 117-138, https://doi.org/10.1016/j.orggeochem.2004.06.014 . [all data]