2,2-Dimethyldocosane

Kovats' RI, non-polar column, custom temperature program

View large format table.

Column type Active phase I Reference Comment
CapillaryHP-5MS2317.Kenig, Simons, et al., 200530. m/0.25 mm/0.25 μm, He; Program: 60C(1.5min) => 20C/min => 130C => 4C/min => 315C (90min)

References

Kenig, Simons, et al., 2005
Kenig, F.; Simons, D.-J.H.; Crich, D.; Cowen, J.P.; Ventura, G.T.; Rehbein-Khalily, T., Structure and distribution of branched aliphatic alkanes with quaternary carbon atoms in Cenomanian and Turonian black shales of Pasquia Hills (Saskatchewan, Canada), Org. Geochem., 2005, 36, 1, 117-138, https://doi.org/10.1016/j.orggeochem.2004.06.014 . [all data]