Rhamnose, MO-TMS, II

Van Den Dool and Kratz RI, non-polar column, temperature ramp

View large format table.

Column type Active phase I Reference Comment
CapillaryDB-5MS1723.5Jonsson, Johansson, et al., 200510. m/0.18 mm/0.18 μm, 70. C @ 2. min, 40. K/min, 320. C @ 2. min

Normal alkane RI, non-polar column, isothermal

View large format table.

Column type Active phase Temperature (C) I Reference Comment
CapillaryOV-101175.1760.Zegota, 1980Column length: 50. m; Column diameter: 0.30 mm
CapillarySE-30165.1760.Zegota, 198035; Column diameter: 0.30 mm

References

Jonsson, Johansson, et al., 2005
Jonsson, P.; Johansson, A.I.; Gullberg, J.; Trygg, J.; Jiye, A.; Grung, B.; Marklund, S.; Sjöström, M.; Antti, H.; Moritz, T., High-throughput data analysis for detecting and identifying differences between samples in GC/MS-based metabolomic analyses, Anal. Chem., 2005, 77, 17, 5635-5642, https://doi.org/10.1021/ac050601e . [all data]

Zegota, 1980
Zegota, H., Separation and quantitative determination of fructose as the O-methyloxime by gas-liquid chromatography using glass capillary columns, J. Chromatogr., 1980, 192, 2, 446-451, https://doi.org/10.1016/S0021-9673(80)80024-0 . [all data]