1,14-Dichloro-3,6,12-trithia-9-oxatetradecane

Van Den Dool and Kratz RI, non-polar column, temperature ramp

View large format table.

Column type Active phase I Reference Comment
CapillaryOV-12419.Kostiainen, 200015. m/0.32 mm/0.25 μm, He, 50. C @ 2. min, 10. K/min, 280. C @ 10. min
CapillarySE-542514.5Kostiainen, 200025. m/0.32 mm/0.25 μm, He, 40. C @ 1. min, 10. K/min, 280. C @ 10. min
CapillaryDB-12419.D'agostino and Provost, 198815. m/0.32 mm/0.25 μm, He, 50. C @ 2. min, 10. K/min, 300. C @ 5. min
CapillaryDB-52514.5D'agostino and Provost, 198815. m/0.32 mm/0.25 μm, 50. C @ 2. min, 10. K/min, 300. C @ 5. min

References

Kostiainen, 2000
Kostiainen, O., Gas Chromatography in Screening of Chemicals Related to the Chemical Weapons Convention in Encyclopedia of Analytical Chemistry, Meyers, R.A., ed(s)., John Wiley Sons Ltd, Chichester, 2000, 963-979. [all data]

D'agostino and Provost, 1988
D'agostino, P.A.; Provost, L.R., Gas chromatographic retention indices of sulphur vesicants and related compounds, J. Chromatogr., 1988, 436, 399-411, https://doi.org/10.1016/S0021-9673(00)94599-0 . [all data]