Clonazepam, methylated

Van Den Dool and Kratz RI, non-polar column, temperature ramp

Data compiled by: NIST Mass Spectrometry Data Center, William E. Wallace, director

Column type Capillary
Active phase SPB-1
Column length (m) 30.
Carrier gas He
Substrate
Column diameter (mm) 0.75
Phase thickness (μm) 1.0
Tstart (C) 160.
Tend (C) 280.
Heat rate (K/min) 10.
Initial hold (min)
Final hold (min) 12.
I 2766.
ReferenceChrist, Noomano, et al., 1988
Comment MSDC-RI

References

Christ, Noomano, et al., 1988
Christ, D.W.; Noomano, P.; Rosas, M.; Rhone, D., Retention indices by wide-bore capillary gas chromatography with nitrogen-phosphorus detection, J. Anal. Toxicol., 1988, 12, 2, 84-88, https://doi.org/10.1093/jat/12.2.84 . [all data]