(E)-Longipinocarveol

Normal alkane RI, non-polar column, temperature ramp

Data compiled by: NIST Mass Spectrometry Data Center, William E. Wallace, director

Column type Capillary
Active phase DB-1
Column length (m) 60.
Carrier gas N2
Substrate
Column diameter (mm) 0.25
Phase thickness (μm) 0.25
Tstart (C) 60.
Tend (C) 250.
Heat rate (K/min) 5.
Initial hold (min)
Final hold (min) 10.
I 1721.
ReferenceFakhari A.R., Sonboli A., et al., 2005
Comment MSDC-RI

References

Fakhari A.R., Sonboli A., et al., 2005
Fakhari A.R.; Sonboli A.; Heydari R., Composition of the essential oil of Rhabdosciadium strausii from Iran, Chem. Nat. Compd. (Engl. Transl.), 2005, 41, 4, 413-414, https://doi.org/10.1007/s10600-005-0164-1 . [all data]