2-Isopropylidene-3-methyl-cyclopent-2-en-4-ol

Normal alkane RI, non-polar column, temperature ramp

View large format table.

Column type Active phase I Reference Comment
CapillaryDB-51220.Chagonda and Chalchat, 200550. m/0.3 mm/0.25 μm, 2. K/min; Tstart: 60. C; Tend: 240. C

References

Chagonda and Chalchat, 2005
Chagonda, L.S.; Chalchat, J.-C., The essential oil of wild and cultivated Hoslundia opposita Vahl. from Zimbabwe, Flavour Fragr. J., 2005, 20, 2, 193-195, https://doi.org/10.1002/ffj.1402 . [all data]