Silphiperfol-5-en-3-yl acetate A

Normal alkane RI, non-polar column, temperature ramp

Data compiled by: NIST Mass Spectrometry Data Center, William E. Wallace, director

Column type Capillary
Active phase DB-5
Column length (m) 30.
Carrier gas He
Substrate
Column diameter (mm) 0.249
Phase thickness (μm) 0.25
Tstart (C) 60.
Tend (C) 290.
Heat rate (K/min) 3.
Initial hold (min)
Final hold (min)
I 1652.
ReferenceBos, Stojanova, et al., 2005
Comment MSDC-RI

References

Bos, Stojanova, et al., 2005
Bos, R.; Stojanova, A.; Woerdenbag, H.J.; Koulman, A.; Quax, W.J., Volatile components of the aerial parts of Artemisia pontica L. grown in Bulgaria, Flavour Fragr. J., 2005, 20, 2, 145-148, https://doi.org/10.1002/ffj.1399 . [all data]