Silphin-1-ene

Van Den Dool and Kratz RI, polar column, temperature ramp

Data compiled by: NIST Mass Spectrometry Data Center, William E. Wallace, director

Column type CapillaryCapillaryCapillary
Active phase RTX-WaxRTX-WaxRTX-Wax
Column length (m) 60.60.60.
Carrier gas HeHeHe
Substrate
Column diameter (mm) 0.220.220.22
Phase thickness (μm) 0.250.250.25
Tstart (C) 60.60.60.
Tend (C) 230.230.230.
Heat rate (K/min) 2.2.2.
Initial hold (min)
Final hold (min) 35.35.35.
I 1474.1474.1474.
ReferencePaolini J., Costa J., et al., 2007Paolini, Muselli, et al., 2007Paolini, Costa, et al., 2005
Comment MSDC-RI MSDC-RI MSDC-RI

Van Den Dool and Kratz RI, non-polar column, temperature ramp

View large format table.

Column type Active phase I Reference Comment
CapillaryRTX-11339.Muselli, Rossi, et al., 200760. m/0.22 mm/0.25 μm, He, 2. K/min, 230. C @ 30. min; Tstart: 60. C
CapillaryRTX-11348.Paolini J., Costa J., et al., 200760. m/0.22 mm/0.25 μm, He, 2. K/min, 230. C @ 35. min; Tstart: 60. C
CapillaryRTX-11348.Paolini, Muselli, et al., 200760. m/0.22 mm/0.25 μm, He, 2. K/min, 230. C @ 35. min; Tstart: 60. C
CapillarySPB-11329.Blagojevic, Radulovic, et al., 200630. m/0.25 mm/0.25 μm, He, 50. C @ 3. min, 5. K/min, 250. C @ 15. min
CapillaryDB-51351.Blagojevic, Radulovic, et al., 200630. m/0.2 mm/0.25 μm, He, 50. C @ 3. min, 5. K/min, 250. C @ 15. min
CapillaryRTX-11348.Paolini, Costa, et al., 200560. m/0.22 mm/0.25 μm, He, 2. K/min, 230. C @ 35. min; Tstart: 60. C

Normal alkane RI, non-polar column, temperature ramp

View large format table.

Column type Active phase I Reference Comment
CapillaryDB-51340.Bos, Stojanova, et al., 200530. m/0.249 mm/0.25 μm, He, 3. K/min; Tstart: 60. C; Tend: 290. C

References

Paolini J., Costa J., et al., 2007
Paolini J.; Costa J.; Bernardini A.F., Analysis of the essential oil from the roots of Eupatorium cannabinum subsp corsicum (L.) by GC, GC-MS and C-13-NMR, Phytochem. Anal., 2007, 18, 3, 235-244, https://doi.org/10.1002/pca.977 . [all data]

Paolini, Muselli, et al., 2007
Paolini, J.; Muselli, A.; Bernardini, A.-F.; Bighelli, A.; Casanova, J.; Costa, J., Thymol derivatives from essential oil of Doronicum corsicum L., Flavour Fragr. J., 2007, 22, 6, 479-487, https://doi.org/10.1002/ffj.1824 . [all data]

Paolini, Costa, et al., 2005
Paolini, J.; Costa, J.; Bernardini, A., Analysis of the essential oil from aerial parts of Eupatorium cannabinum subsp. corsicum (L.) by gas chromatography with electron impact and chemical ionization mass spectrometry, J. Chromatogr. A, 2005, 1076, 1-2, 170-178, https://doi.org/10.1016/j.chroma.2005.03.131 . [all data]