6-Decenal

Normal alkane RI, non-polar column, custom temperature program

Data compiled by: NIST Mass Spectrometry Data Center, William E. Wallace, director

Column type Capillary
Active phase RTX-5
Column length (m) 30.
Carrier gas N2
Substrate
Column diameter (mm) 0.25
Phase thickness (μm) 0.25
Program not specified
I 1203.
ReferenceÁdámová, Orinák, et al., 2005
Comment MSDC-RI

References

Ádámová, Orinák, et al., 2005
Ádámová, M.; Orinák, A.; Halás, L., Retention indices as identification tool in pyrolysis-capillary gas chromatography, J. Chromatogr. A, 2005, 1087, 1-2, 131-141, https://doi.org/10.1016/j.chroma.2005.01.003 . [all data]