cis-Muurola-5-en-4-β-ol

Kovats' RI, non-polar column, temperature ramp

View large format table.

Column type Active phase I Reference Comment
CapillaryDB-51550.Adams and Nguyen, 200530. m/0.26 mm/0.25 μm, He, 3. K/min; Tstart: 60. C; Tend: 246. C

Normal alkane RI, non-polar column, temperature ramp

View large format table.

Column type Active phase I Reference Comment
CapillaryHP-51550.Cheraif, Ben Jannet, et al., 200730. m/0.25 mm/0.25 μm, N2, 50. C @ 1. min, 5. K/min, 240. C @ 4. min
CapillaryDB-51549.Elfami, Bos, et al., 200730. m/0.26 mm/0.25 μm, Helium, 3. K/min; Tstart: 60. C; Tend: 290. C
CapillaryDB-51549.Elfami, Komar, et al., 200630. m/0.26 mm/0.25 μm, Helium, 3. K/min; Tstart: 60. C; Tend: 290. C
CapillaryHP-51555.Figuérédo, Cabassu, et al., 200530. m/0.25 mm/0.25 μm, He, 50. C @ 5. min, 5. K/min, 300. C @ 5. min

Normal alkane RI, polar column, temperature ramp

View large format table.

Column type Active phase I Reference Comment
CapillaryHP-Innowax2215.Cheraif, Ben Jannet, et al., 200730. m/0.25 mm/0.25 μm, N2, 50. C @ 1. min, 5. K/min, 240. C @ 4. min

References

Adams and Nguyen, 2005
Adams, R.P.; Nguyen, S., Infra-specific variation in Juniperus deppeana and F. Sperryi in the Davis Mountains of Texas: variation in leaf essential oils and random amplified polymorphic DNAS (RAPDS), Phytologia, 2005, 87, 2, 96-108. [all data]

Cheraif, Ben Jannet, et al., 2007
Cheraif, I.; Ben Jannet, H.; Hammami, M.; Khouja, M.L.; Mighri, Z., Chemical composition and antimicrobial activity of essential oils of Cupressus arizonica Greene, Biochem. Syst. Ecol., 2007, 35, 12, 813-820, https://doi.org/10.1016/j.bse.2007.05.009 . [all data]

Elfami, Bos, et al., 2007
Elfami; Bos, R.; Ruslan, K.; Woerdenbag, H.J.; Kayser, P.; Quax, W.J., Essential Oil Constituents of Piper cubeba from Indonesia, 2007, 53-60. [all data]

Elfami, Komar, et al., 2006
Elfami, R.B.; Komar, R.; Woerdenbag, H.J.; Kayser, P.; Quax, W.J., Essential oil constituents of Piper cubeba from Indonesia, 2006, retrieved from http://dissertations.ub.rug.nl/FILES/facultiew/science/2006/elfahmi/05c5.pdf. [all data]

Figuérédo, Cabassu, et al., 2005
Figuérédo, G.; Cabassu, P.; Chalchat, J.-C.; Pasquier, B., Studies of Mediterranean oregano populations- V. Chemical composition of essential oils of oregano: Origanum syriacum L. var. bevanii (Holmes) Ietswaart, O. syriacum L. var. sinaicum (Boiss.) Ietswaart, and O. syriacum L. var. syriacum from Lebanon and Israel, Flavour Fragr. J., 2005, 20, 164-168. [all data]