Germacra-4(15),5,10(14)-trien-1α-ol

Kovats' RI, non-polar column, temperature ramp

View large format table.

Column type Active phase I Reference Comment
CapillaryDB-51686.Adams, Morris, et al., 200530. m/0.26 mm/0.25 μm, He, 3. K/min; Tstart: 60. C; Tend: 246. C

Normal alkane RI, non-polar column, temperature ramp

View large format table.

Column type Active phase I Reference Comment
CapillaryHP-51680.Ristic, Krivokuca-Dokic, et al., 200730. m/0.25 mm/0.25 μm, Helium, 4. K/min; Tstart: 40. C; Tend: 260. C
CapillaryCP Sil 5 CB1680.Ayoub, Al-Azizi, et al., 2006He, 10. K/min; Column length: 25. m; Tstart: 80. C; Tend: 270. C

Normal alkane RI, non-polar column, custom temperature program

View large format table.

Column type Active phase I Reference Comment
CapillaryHP-51680.Ristic, Krivokuca-Dokic, et al., 200730. m/0.25 mm/0.25 μm, Helium; Program: not specified
CapillaryPolydimethyl siloxane1684.Werka, Boehme, et al., 2007Program: not specified
CapillaryCP Sil 5 CB1681.Weyerstahl, Marschall, et al., 1999He; Column length: 25. m; Column diameter: 0.39 mm; Program: not specified

References

Adams, Morris, et al., 2005
Adams, R.P.; Morris, J.A.; Pandey, R.N.; Schwarzbach, A.E., Cryptic speciation between Juniperus deltoides and Juniperus oxycedrus (Cupressaceae) in the Mediterranean, Biochem. Syst. Ecol., 2005, 33, 8, 771-787, https://doi.org/10.1016/j.bse.2005.01.001 . [all data]

Ristic, Krivokuca-Dokic, et al., 2007
Ristic, M.; Krivokuca-Dokic, D.; Radanovic, D.; Nastovski, T., Etarsko ulje Arnica montata i Arnica chamissonis, Hem. Ind., 2007, 61, 5, 272-277, https://doi.org/10.2298/HEMIND0704272R . [all data]

Ayoub, Al-Azizi, et al., 2006
Ayoub, N.; Al-Azizi, M.; König, W.; Kubeczka, K.-H., Essential oils and a novel polyacetylene from Eryngium yuccifolium Michaux. (Apiaceae), Flavour Fragr. J., 2006, 21, 6, 864-868, https://doi.org/10.1002/ffj.1631 . [all data]

Werka, Boehme, et al., 2007
Werka, J.S.; Boehme, A.K.; Setzer, W.N., Biological activities of essential oils from Monteverde, Costa Rica, Natural Product Communications, 2007, 2, 12, 1215-1219. [all data]

Weyerstahl, Marschall, et al., 1999
Weyerstahl, P.; Marschall, H.; Son, P.T.; Giang, P.M., Constituents of the flower essential oil of Aglaia odorata Lour. from Vietnam, Flavour Fragr. J., 1999, 14, 4, 219-224, https://doi.org/10.1002/(SICI)1099-1026(199907/08)14:4<219::AID-FFJ815>3.0.CO;2-# . [all data]